{"text_format":"1","workbook":"xlsx","n_sheets":10,"sheets":["README","Constants","Application","ApplicationTag","ApplicationTagGroup","Integration","IntegrationTag","FieldDefinition","SOURCE Application","SOURCE Integration"],"not_rendered":{"charts":0,"images":0,"macros":1,"external_links":0,"defined_names":7,"comments":0,"pivot_tables":0},"unopened":[],"bounds":{"document_bytes":16777216,"sheet_cells":100000,"rows_first":2000,"rows_last":500,"rows_between":2000,"halvings":0,"cell_chars":16384,"cell_head_chars":4096},"cells_cut":0,"cells_raw":0,"read":"whole","date_system":"1900"}

{"sheet":"README","index":0,"n_rows":10,"n_cols":4,"rows_kept":10,"cut":false,"hidden":false,"merged":[]}
[]
[null,"Aplas Import Template"]
[null,"This is an optional Excel template that provides some support for converting your source application and integration data into a format for CSV/ZIP import to Aplas."]
[]
[null,"Yellow sheets are in Aplas format ready for CSV export."]
[null,"Blue sheets are for your source data (examples provided). This data is referenced in the yellow target sheets."]
[]
[null,"Helper functions"]
[null,"STRINGTOID(string)",null,"Converts a string to Aplas ID format."]
[null,"TOID(cell)",null,"Converts a referenced cell to Aplas ID format."]

{"sheet":"Constants","index":1,"n_rows":5,"n_cols":2,"rows_kept":5,"cut":false,"hidden":false,"merged":[]}
["Small name size",20]
["Version default","1.0"]
["Status default","Standard"]
["Vendor default","Unknown"]
["Payload default","Data"]

{"sheet":"Application","index":2,"n_rows":47,"n_cols":9,"rows_kept":47,"cut":false,"hidden":false,"merged":[]}
["Id","Name","ShortName","Version","Vendor","TagIds","MapSize","Status","Description"]
[{"$f":"TOID(B2)","v":"sap_finance"},{"$f":"IF('SOURCE Application'!A2<>\"\",'SOURCE Application'!A2,\"\")","v":"SAP Finance"},{"$f":"LEFT(B2, VLOOKUP(\"Small name size\", Constants, 2))","v":"SAP Finance"},{"$f":"IF('SOURCE Application'!D2<>\"\",'SOURCE Application'!D2,VLOOKUP(\"Version default\", Constants, 2))","v":"Data"},{"$f":"IF('SOURCE Application'!B2<>\"\",'SOURCE Application'!B2,VLOOKUP(\"Vendor default\", Constants, 2))","v":"SAP"},{"$f":"STRINGTOID(IF('SOURCE Application'!E2<>\"\",'SOURCE Application'!E2,ApplicationTag!A$2))","v":"core_accounting_platform"},"Regular",{"$f":"VLOOKUP(\"Status default\", Constants, 2)","v":"Standard"},{"$f":"IF('SOURCE Application'!E2<>\"\",'SOURCE Application'!E2,\"\")","v":"Core accounting platform"}]
[{"$f":"TOID(B3)","v":"salesforce"},{"$f":"IF('SOURCE Application'!A3<>\"\",'SOURCE Application'!A3,\"\")","v":"Salesforce"},{"$f":"LEFT(B3, VLOOKUP(\"Small name size\", Constants, 2))","v":"Salesforce"},{"$f":"IF('SOURCE Application'!D3<>\"\",'SOURCE Application'!D3,VLOOKUP(\"Version default\", Constants, 2))","v":"Data"},{"$f":"IF('SOURCE Application'!B3<>\"\",'SOURCE Application'!B3,VLOOKUP(\"Vendor default\", Constants, 2))","v":"Salesforce"},{"$f":"STRINGTOID(IF('SOURCE Application'!E3<>\"\",'SOURCE Application'!E3,ApplicationTag!A$2))","v":"core_crm_paltform"},"Regular",{"$f":"VLOOKUP(\"Status default\", Constants, 2)","v":"Standard"},{"$f":"IF('SOURCE Application'!E3<>\"\",'SOURCE Application'!E3,\"\")","v":"Core CRM paltform"}]
[{"$f":"TOID(B4)","v":""},{"$f":"IF('SOURCE Application'!A4<>\"\",'SOURCE Application'!A4,\"\")","v":""},{"$f":"LEFT(B4, VLOOKUP(\"Small name size\", Constants, 2))","v":""},{"$f":"IF('SOURCE Application'!D4<>\"\",'SOURCE Application'!D4,VLOOKUP(\"Version default\", Constants, 2))","v":"Data"},{"$f":"IF('SOURCE Application'!B4<>\"\",'SOURCE Application'!B4,VLOOKUP(\"Vendor default\", Constants, 2))","v":"Unknown"},{"$f":"STRINGTOID(IF('SOURCE Application'!E4<>\"\",'SOURCE Application'!E4,ApplicationTag!A$2))","v":"unknown"},"Regular",{"$f":"VLOOKUP(\"Status default\", Constants, 2)","v":"Standard"},{"$f":"IF('SOURCE Application'!E4<>\"\",'SOURCE Application'!E4,\"\")","v":""}]
[{"$f":"TOID(B5)","v":""},{"$f":"IF('SOURCE Application'!A5<>\"\",'SOURCE Application'!A5,\"\")","v":""},{"$f":"LEFT(B5, VLOOKUP(\"Small name size\", Constants, 2))","v":""},{"$f":"IF('SOURCE Application'!D5<>\"\",'SOURCE Application'!D5,VLOOKUP(\"Version default\", Constants, 2))","v":"Data"},{"$f":"IF('SOURCE Application'!B5<>\"\",'SOURCE Application'!B5,VLOOKUP(\"Vendor default\", Constants, 2))","v":"Unknown"},{"$f":"STRINGTOID(IF('SOURCE Application'!E5<>\"\",'SOURCE Application'!E5,ApplicationTag!A$2))","v":"unknown"},"Regular",{"$f":"VLOOKUP(\"Status default\", Constants, 2)","v":"Standard"},{"$f":"IF('SOURCE Application'!E5<>\"\",'SOURCE Application'!E5,\"\")","v":""}]
[{"$f":"TOID(B6)","v":""},{"$f":"IF('SOURCE Application'!A6<>\"\",'SOURCE Application'!A6,\"\")","v":""},{"$f":"LEFT(B6, VLOOKUP(\"Small name size\", Constants, 2))","v":""},{"$f":"IF('SOURCE Application'!D6<>\"\",'SOURCE Application'!D6,VLOOKUP(\"Version default\", Constants, 2))","v":"Data"},{"$f":"IF('SOURCE Application'!B6<>\"\",'SOURCE Application'!B6,VLOOKUP(\"Vendor default\", Constants, 2))","v":"Unknown"},{"$f":"STRINGTOID(IF('SOURCE Application'!E6<>\"\",'SOURCE Application'!E6,ApplicationTag!A$2))","v":"unknown"},"Regular",{"$f":"VLOOKUP(\"Status default\", Constants, 2)","v":"Standard"},{"$f":"IF('SOURCE Application'!E6<>\"\",'SOURCE Application'!E6,\"\")","v":""}]
[{"$f":"TOID(B7)","v":""},{"$f":"IF('SOURCE Application'!A7<>\"\",'SOURCE Application'!A7,\"\")","v":""},{"$f":"LEFT(B7, VLOOKUP(\"Small name size\", Constants, 2))","v":""},{"$f":"IF('SOURCE Application'!D7<>\"\",'SOURCE Application'!D7,VLOOKUP(\"Version default\", Constants, 2))","v":"Data"},{"$f":"IF('SOURCE Application'!B7<>\"\",'SOURCE Application'!B7,VLOOKUP(\"Vendor default\", Constants, 2))","v":"Unknown"},{"$f":"STRINGTOID(IF('SOURCE Application'!E7<>\"\",'SOURCE Application'!E7,ApplicationTag!A$2))","v":"unknown"},"Regular",{"$f":"VLOOKUP(\"Status default\", Constants, 2)","v":"Standard"},{"$f":"IF('SOURCE Application'!E7<>\"\",'SOURCE Application'!E7,\"\")","v":""}]
[{"$f":"TOID(B8)","v":""},{"$f":"IF('SOURCE Application'!A8<>\"\",'SOURCE Application'!A8,\"\")","v":""},{"$f":"LEFT(B8, VLOOKUP(\"Small name size\", Constants, 2))","v":""},{"$f":"IF('SOURCE Application'!D8<>\"\",'SOURCE Application'!D8,VLOOKUP(\"Version default\", Constants, 2))","v":"Data"},{"$f":"IF('SOURCE Application'!B8<>\"\",'SOURCE Application'!B8,VLOOKUP(\"Vendor default\", Constants, 2))","v":"Unknown"},{"$f":"STRINGTOID(IF('SOURCE Application'!E8<>\"\",'SOURCE Application'!E8,ApplicationTag!A$2))","v":"unknown"},"Regular",{"$f":"VLOOKUP(\"Status default\", Constants, 2)","v":"Standard"},{"$f":"IF('SOURCE Application'!E8<>\"\",'SOURCE Application'!E8,\"\")","v":""}]
[{"$f":"TOID(B9)","v":""},{"$f":"IF('SOURCE Application'!A9<>\"\",'SOURCE Application'!A9,\"\")","v":""},{"$f":"LEFT(B9, VLOOKUP(\"Small name size\", Constants, 2))","v":""},{"$f":"IF('SOURCE Application'!D9<>\"\",'SOURCE Application'!D9,VLOOKUP(\"Version default\", Constants, 2))","v":"Data"},{"$f":"IF('SOURCE Application'!B9<>\"\",'SOURCE Application'!B9,VLOOKUP(\"Vendor default\", Constants, 2))","v":"Unknown"},{"$f":"STRINGTOID(IF('SOURCE Application'!E9<>\"\",'SOURCE Application'!E9,ApplicationTag!A$2))","v":"unknown"},"Regular",{"$f":"VLOOKUP(\"Status default\", Constants, 2)","v":"Standard"},{"$f":"IF('SOURCE Application'!E9<>\"\",'SOURCE Application'!E9,\"\")","v":""}]
[{"$f":"TOID(B10)","v":""},{"$f":"IF('SOURCE Application'!A10<>\"\",'SOURCE Application'!A10,\"\")","v":""},{"$f":"LEFT(B10, VLOOKUP(\"Small name size\", Constants, 2))","v":""},{"$f":"IF('SOURCE Application'!D10<>\"\",'SOURCE Application'!D10,VLOOKUP(\"Version default\", Constants, 2))","v":"Data"},{"$f":"IF('SOURCE Application'!B10<>\"\",'SOURCE Application'!B10,VLOOKUP(\"Vendor default\", Constants, 2))","v":"Unknown"},{"$f":"STRINGTOID(IF('SOURCE Application'!E10<>\"\",'SOURCE Application'!E10,ApplicationTag!A$2))","v":"unknown"},"Regular",{"$f":"VLOOKUP(\"Status default\", Constants, 2)","v":"Standard"},{"$f":"IF('SOURCE Application'!E10<>\"\",'SOURCE Application'!E10,\"\")","v":""}]
[{"$f":"TOID(B11)","v":""},{"$f":"IF('SOURCE Application'!A11<>\"\",'SOURCE Application'!A11,\"\")","v":""},{"$f":"LEFT(B11, VLOOKUP(\"Small name size\", Constants, 2))","v":""},{"$f":"IF('SOURCE Application'!D11<>\"\",'SOURCE Application'!D11,VLOOKUP(\"Version default\", Constants, 2))","v":"Data"},{"$f":"IF('SOURCE Application'!B11<>\"\",'SOURCE Application'!B11,VLOOKUP(\"Vendor default\", Constants, 2))","v":"Unknown"},{"$f":"STRINGTOID(IF('SOURCE Application'!E11<>\"\",'SOURCE Application'!E11,ApplicationTag!A$2))","v":"unknown"},"Regular",{"$f":"VLOOKUP(\"Status default\", Constants, 2)","v":"Standard"},{"$f":"IF('SOURCE Application'!E11<>\"\",'SOURCE Application'!E11,\"\")","v":""}]
[{"$f":"TOID(B12)","v":""},{"$f":"IF('SOURCE Application'!A12<>\"\",'SOURCE Application'!A12,\"\")","v":""},{"$f":"LEFT(B12, VLOOKUP(\"Small name size\", Constants, 2))","v":""},{"$f":"IF('SOURCE Application'!D12<>\"\",'SOURCE Application'!D12,VLOOKUP(\"Version default\", Constants, 2))","v":"Data"},{"$f":"IF('SOURCE Application'!B12<>\"\",'SOURCE Application'!B12,VLOOKUP(\"Vendor default\", Constants, 2))","v":"Unknown"},{"$f":"STRINGTOID(IF('SOURCE Application'!E12<>\"\",'SOURCE Application'!E12,ApplicationTag!A$2))","v":"unknown"},"Regular",{"$f":"VLOOKUP(\"Status default\", Constants, 2)","v":"Standard"},{"$f":"IF('SOURCE Application'!E12<>\"\",'SOURCE Application'!E12,\"\")","v":""}]
[{"$f":"TOID(B13)","v":""},{"$f":"IF('SOURCE Application'!A13<>\"\",'SOURCE Application'!A13,\"\")","v":""},{"$f":"LEFT(B13, VLOOKUP(\"Small name size\", Constants, 2))","v":""},{"$f":"IF('SOURCE Application'!D13<>\"\",'SOURCE Application'!D13,VLOOKUP(\"Version default\", Constants, 2))","v":"Data"},{"$f":"IF('SOURCE Application'!B13<>\"\",'SOURCE Application'!B13,VLOOKUP(\"Vendor default\", Constants, 2))","v":"Unknown"},{"$f":"STRINGTOID(IF('SOURCE Application'!E13<>\"\",'SOURCE Application'!E13,ApplicationTag!A$2))","v":"unknown"},"Regular",{"$f":"VLOOKUP(\"Status default\", Constants, 2)","v":"Standard"},{"$f":"IF('SOURCE Application'!E13<>\"\",'SOURCE Application'!E13,\"\")","v":""}]
[{"$f":"TOID(B14)","v":""},{"$f":"IF('SOURCE Application'!A14<>\"\",'SOURCE Application'!A14,\"\")","v":""},{"$f":"LEFT(B14, VLOOKUP(\"Small name size\", Constants, 2))","v":""},{"$f":"IF('SOURCE Application'!D14<>\"\",'SOURCE Application'!D14,VLOOKUP(\"Version default\", Constants, 2))","v":"Data"},{"$f":"IF('SOURCE Application'!B14<>\"\",'SOURCE Application'!B14,VLOOKUP(\"Vendor default\", Constants, 2))","v":"Unknown"},{"$f":"STRINGTOID(IF('SOURCE Application'!E14<>\"\",'SOURCE Application'!E14,ApplicationTag!A$2))","v":"unknown"},"Regular",{"$f":"VLOOKUP(\"Status default\", Constants, 2)","v":"Standard"},{"$f":"IF('SOURCE Application'!E14<>\"\",'SOURCE Application'!E14,\"\")","v":""}]
[{"$f":"TOID(B15)","v":""},{"$f":"IF('SOURCE Application'!A15<>\"\",'SOURCE Application'!A15,\"\")","v":""},{"$f":"LEFT(B15, VLOOKUP(\"Small name size\", Constants, 2))","v":""},{"$f":"IF('SOURCE Application'!D15<>\"\",'SOURCE Application'!D15,VLOOKUP(\"Version default\", Constants, 2))","v":"Data"},{"$f":"IF('SOURCE Application'!B15<>\"\",'SOURCE Application'!B15,VLOOKUP(\"Vendor default\", Constants, 2))","v":"Unknown"},{"$f":"STRINGTOID(IF('SOURCE Application'!E15<>\"\",'SOURCE Application'!E15,ApplicationTag!A$2))","v":"unknown"},"Regular",{"$f":"VLOOKUP(\"Status default\", Constants, 2)","v":"Standard"},{"$f":"IF('SOURCE Application'!E15<>\"\",'SOURCE Application'!E15,\"\")","v":""}]
{"$rows_left_out":33}
{"sheet":"ApplicationTag","index":3,"n_rows":42,"n_cols":8,"rows_kept":42,"cut":false,"hidden":false,"merged":[]}
["Id","Name","ShortName","Color","Status","ParentTagId","TagGroupId","Description"]
["unknown","Unknown",{"$f":"LEFT(B2, VLOOKUP(\"Small name size\", Constants, 2))","v":"Unknown"},"#B00000","Standard",null,{"$f":"ApplicationTagGroup!A$2","v":"default"}]
[{"$f":"TOID(B3)","v":"accounts"},{"$f":"_xlfn.UNIQUE('SOURCE Application'!C2:C52)","v":"Accounts"},{"$f":"LEFT(B3, VLOOKUP(\"Small name size\", Constants, 2))","v":"Accounts"},"#CC9900","Standard",null,{"$f":"ApplicationTagGroup!A$2","v":"default"}]
[{"$f":"TOID(B4)","v":"sales"},"Sales",{"$f":"LEFT(B4, VLOOKUP(\"Small name size\", Constants, 2))","v":"Sales"},"#385D35","Standard",null,{"$f":"ApplicationTagGroup!A$2","v":"default"}]
[{"$f":"TOID(B5)","v":"0"},0,{"$f":"LEFT(B5, VLOOKUP(\"Small name size\", Constants, 2))","v":"0"},"#11868D","Standard",null,{"$f":"ApplicationTagGroup!A$2","v":"default"}]
[{"$f":"TOID(B6)","v":""},null,{"$f":"LEFT(B6, VLOOKUP(\"Small name size\", Constants, 2))","v":""},"#CC9900","Standard",null,{"$f":"ApplicationTagGroup!A$2","v":"default"}]
[{"$f":"TOID(B7)","v":""},null,{"$f":"LEFT(B7, VLOOKUP(\"Small name size\", Constants, 2))","v":""},"#CC9900","Standard",null,{"$f":"ApplicationTagGroup!A$2","v":"default"}]
[{"$f":"TOID(B8)","v":""},null,{"$f":"LEFT(B8, VLOOKUP(\"Small name size\", Constants, 2))","v":""},"#1D99C7","Standard",null,{"$f":"ApplicationTagGroup!A$2","v":"default"}]
[{"$f":"TOID(B9)","v":""},null,{"$f":"LEFT(B9, VLOOKUP(\"Small name size\", Constants, 2))","v":""},"#B00000","Standard",null,{"$f":"ApplicationTagGroup!A$2","v":"default"}]
[{"$f":"TOID(B10)","v":""},null,{"$f":"LEFT(B10, VLOOKUP(\"Small name size\", Constants, 2))","v":""},"#B00000","Standard",null,{"$f":"ApplicationTagGroup!A$2","v":"default"}]
[{"$f":"TOID(B11)","v":""},null,{"$f":"LEFT(B11, VLOOKUP(\"Small name size\", Constants, 2))","v":""},"#B00000","Standard",null,{"$f":"ApplicationTagGroup!A$2","v":"default"}]
[{"$f":"TOID(B12)","v":""},null,{"$f":"LEFT(B12, VLOOKUP(\"Small name size\", Constants, 2))","v":""},"#385D35","Standard",null,{"$f":"ApplicationTagGroup!A$2","v":"default"}]
[{"$f":"TOID(B13)","v":""},null,{"$f":"LEFT(B13, VLOOKUP(\"Small name size\", Constants, 2))","v":""},"#385D35","Standard",null,{"$f":"ApplicationTagGroup!A$2","v":"default"}]
[{"$f":"TOID(B14)","v":""},null,{"$f":"LEFT(B14, VLOOKUP(\"Small name size\", Constants, 2))","v":""},"#11868D","Standard",null,{"$f":"ApplicationTagGroup!A$2","v":"default"}]
[{"$f":"TOID(B15)","v":""},null,{"$f":"LEFT(B15, VLOOKUP(\"Small name size\", Constants, 2))","v":""},"#11868D","Standard",null,{"$f":"ApplicationTagGroup!A$2","v":"default"}]
{"$rows_left_out":28}
{"sheet":"ApplicationTagGroup","index":4,"n_rows":2,"n_cols":2,"rows_kept":2,"cut":false,"hidden":false,"merged":[]}
["Id","Name"]
["default","Default"]

{"sheet":"Integration","index":5,"n_rows":26,"n_cols":10,"rows_kept":26,"cut":false,"hidden":false,"merged":[]}
["Id","Name","ShortName","Version","TagIds","SourceApplicationId","TargetApplicationId","Payload","Status","Description"]
[{"$f":"TOID(B2)","v":"int_001"},{"$f":"\"INT-\"&TEXT(ROW($A1), \"000\")","v":"INT-001"},{"$f":"LEFT(B2, VLOOKUP(\"Small name size\", Constants, 2))","v":"INT-001"},{"$f":"IF('SOURCE Integration'!F2<>\"\",'SOURCE Integration'!F2,VLOOKUP(\"Version default\", Constants, 2))","v":"Data"},{"$f":"STRINGTOID(IF('SOURCE Integration'!E2<>\"\",'SOURCE Integration'!E2,IntegrationTag!A$2))","v":"invoice"},{"$f":"TOID('SOURCE Integration'!C2)","v":"sap_finance"},{"$f":"TOID('SOURCE Integration'!D2)","v":"salesforce"},{"$f":"IF('SOURCE Integration'!E2<>\"\",'SOURCE Integration'!E2,VLOOKUP(\"Payload default\", Constants, 2))","v":"Invoice"},"Standard"]
[{"$f":"TOID(B3)","v":"int_002"},{"$f":"\"INT-\"&TEXT(ROW($A2), \"000\")","v":"INT-002"},{"$f":"LEFT(B3, VLOOKUP(\"Small name size\", Constants, 2))","v":"INT-002"},{"$f":"IF('SOURCE Integration'!F3<>\"\",'SOURCE Integration'!F3,VLOOKUP(\"Version default\", Constants, 2))","v":"Data"},{"$f":"STRINGTOID(IF('SOURCE Integration'!E3<>\"\",'SOURCE Integration'!E3,IntegrationTag!A$2))","v":"invoice"},{"$f":"TOID('SOURCE Integration'!C3)","v":"salesforce"},{"$f":"TOID('SOURCE Integration'!D3)","v":"sap_finance"},{"$f":"IF('SOURCE Integration'!E3<>\"\",'SOURCE Integration'!E3,VLOOKUP(\"Payload default\", Constants, 2))","v":"Invoice"},"Standard"]
[{"$f":"TOID(B4)","v":"int_003"},"INT-003",{"$f":"LEFT(B4, VLOOKUP(\"Small name size\", Constants, 2))","v":"INT-003"},{"$f":"IF('SOURCE Integration'!F4<>\"\",'SOURCE Integration'!F4,VLOOKUP(\"Version default\", Constants, 2))","v":"Data"},{"$f":"STRINGTOID(IF('SOURCE Integration'!E4<>\"\",'SOURCE Integration'!E4,IntegrationTag!A$2))","v":"unknown"},{"$f":"TOID('SOURCE Integration'!C4)","v":""},{"$f":"TOID('SOURCE Integration'!D4)","v":""},{"$f":"IF('SOURCE Integration'!E4<>\"\",'SOURCE Integration'!E4,VLOOKUP(\"Payload default\", Constants, 2))","v":{"$error":"#N/A"}}]
[{"$f":"TOID(B5)","v":"int_004"},"INT-004",{"$f":"LEFT(B5, VLOOKUP(\"Small name size\", Constants, 2))","v":"INT-004"},{"$f":"IF('SOURCE Integration'!F5<>\"\",'SOURCE Integration'!F5,VLOOKUP(\"Version default\", Constants, 2))","v":"Data"},{"$f":"STRINGTOID(IF('SOURCE Integration'!E5<>\"\",'SOURCE Integration'!E5,IntegrationTag!A$2))","v":"unknown"},{"$f":"TOID('SOURCE Integration'!C5)","v":""},{"$f":"TOID('SOURCE Integration'!D5)","v":""},{"$f":"IF('SOURCE Integration'!E5<>\"\",'SOURCE Integration'!E5,VLOOKUP(\"Payload default\", Constants, 2))","v":{"$error":"#N/A"}}]
[{"$f":"TOID(B6)","v":"int_005"},"INT-005",{"$f":"LEFT(B6, VLOOKUP(\"Small name size\", Constants, 2))","v":"INT-005"},{"$f":"IF('SOURCE Integration'!F6<>\"\",'SOURCE Integration'!F6,VLOOKUP(\"Version default\", Constants, 2))","v":"Data"},{"$f":"STRINGTOID(IF('SOURCE Integration'!E6<>\"\",'SOURCE Integration'!E6,IntegrationTag!A$2))","v":"unknown"},{"$f":"TOID('SOURCE Integration'!C6)","v":""},{"$f":"TOID('SOURCE Integration'!D6)","v":""},{"$f":"IF('SOURCE Integration'!E6<>\"\",'SOURCE Integration'!E6,VLOOKUP(\"Payload default\", Constants, 2))","v":{"$error":"#N/A"}}]
[{"$f":"TOID(B7)","v":"int_006"},"INT-006",{"$f":"LEFT(B7, VLOOKUP(\"Small name size\", Constants, 2))","v":"INT-006"},{"$f":"IF('SOURCE Integration'!F7<>\"\",'SOURCE Integration'!F7,VLOOKUP(\"Version default\", Constants, 2))","v":"Data"},{"$f":"STRINGTOID(IF('SOURCE Integration'!E7<>\"\",'SOURCE Integration'!E7,IntegrationTag!A$2))","v":"unknown"},{"$f":"TOID('SOURCE Integration'!C7)","v":""},{"$f":"TOID('SOURCE Integration'!D7)","v":""},{"$f":"IF('SOURCE Integration'!E7<>\"\",'SOURCE Integration'!E7,VLOOKUP(\"Payload default\", Constants, 2))","v":{"$error":"#N/A"}}]
[{"$f":"TOID(B8)","v":"int_007"},"INT-007",{"$f":"LEFT(B8, VLOOKUP(\"Small name size\", Constants, 2))","v":"INT-007"},{"$f":"IF('SOURCE Integration'!F8<>\"\",'SOURCE Integration'!F8,VLOOKUP(\"Version default\", Constants, 2))","v":"Data"},{"$f":"STRINGTOID(IF('SOURCE Integration'!E8<>\"\",'SOURCE Integration'!E8,IntegrationTag!A$2))","v":"unknown"},{"$f":"TOID('SOURCE Integration'!C8)","v":""},{"$f":"TOID('SOURCE Integration'!D8)","v":""},{"$f":"IF('SOURCE Integration'!E8<>\"\",'SOURCE Integration'!E8,VLOOKUP(\"Payload default\", Constants, 2))","v":{"$error":"#N/A"}}]
[{"$f":"TOID(B9)","v":"int_008"},"INT-008",{"$f":"LEFT(B9, VLOOKUP(\"Small name size\", Constants, 2))","v":"INT-008"},{"$f":"IF('SOURCE Integration'!F9<>\"\",'SOURCE Integration'!F9,VLOOKUP(\"Version default\", Constants, 2))","v":"Data"},{"$f":"STRINGTOID(IF('SOURCE Integration'!E9<>\"\",'SOURCE Integration'!E9,IntegrationTag!A$2))","v":"unknown"},{"$f":"TOID('SOURCE Integration'!C9)","v":""},{"$f":"TOID('SOURCE Integration'!D9)","v":""},{"$f":"IF('SOURCE Integration'!E9<>\"\",'SOURCE Integration'!E9,VLOOKUP(\"Payload default\", Constants, 2))","v":{"$error":"#N/A"}}]
[{"$f":"TOID(B10)","v":"int_009"},"INT-009",{"$f":"LEFT(B10, VLOOKUP(\"Small name size\", Constants, 2))","v":"INT-009"},{"$f":"IF('SOURCE Integration'!F10<>\"\",'SOURCE Integration'!F10,VLOOKUP(\"Version default\", Constants, 2))","v":"Data"},{"$f":"STRINGTOID(IF('SOURCE Integration'!E10<>\"\",'SOURCE Integration'!E10,IntegrationTag!A$2))","v":"unknown"},{"$f":"TOID('SOURCE Integration'!C10)","v":""},{"$f":"TOID('SOURCE Integration'!D10)","v":""},{"$f":"IF('SOURCE Integration'!E10<>\"\",'SOURCE Integration'!E10,VLOOKUP(\"Payload default\", Constants, 2))","v":{"$error":"#N/A"}}]
[{"$f":"TOID(B11)","v":"int_010"},"INT-010",{"$f":"LEFT(B11, VLOOKUP(\"Small name size\", Constants, 2))","v":"INT-010"},{"$f":"IF('SOURCE Integration'!F11<>\"\",'SOURCE Integration'!F11,VLOOKUP(\"Version default\", Constants, 2))","v":"Data"},{"$f":"STRINGTOID(IF('SOURCE Integration'!E11<>\"\",'SOURCE Integration'!E11,IntegrationTag!A$2))","v":"unknown"},{"$f":"TOID('SOURCE Integration'!C11)","v":""},{"$f":"TOID('SOURCE Integration'!D11)","v":""},{"$f":"IF('SOURCE Integration'!E11<>\"\",'SOURCE Integration'!E11,VLOOKUP(\"Payload default\", Constants, 2))","v":{"$error":"#N/A"}}]
[{"$f":"TOID(B12)","v":"int_011"},"INT-011",{"$f":"LEFT(B12, VLOOKUP(\"Small name size\", Constants, 2))","v":"INT-011"},{"$f":"IF('SOURCE Integration'!F12<>\"\",'SOURCE Integration'!F12,VLOOKUP(\"Version default\", Constants, 2))","v":"Data"},{"$f":"STRINGTOID(IF('SOURCE Integration'!E12<>\"\",'SOURCE Integration'!E12,IntegrationTag!A$2))","v":"unknown"},{"$f":"TOID('SOURCE Integration'!C12)","v":""},{"$f":"TOID('SOURCE Integration'!D12)","v":""},{"$f":"IF('SOURCE Integration'!E12<>\"\",'SOURCE Integration'!E12,VLOOKUP(\"Payload default\", Constants, 2))","v":{"$error":"#N/A"}}]
[{"$f":"TOID(B13)","v":"int_012"},"INT-012",{"$f":"LEFT(B13, VLOOKUP(\"Small name size\", Constants, 2))","v":"INT-012"},{"$f":"IF('SOURCE Integration'!F13<>\"\",'SOURCE Integration'!F13,VLOOKUP(\"Version default\", Constants, 2))","v":"Data"},{"$f":"STRINGTOID(IF('SOURCE Integration'!E13<>\"\",'SOURCE Integration'!E13,IntegrationTag!A$2))","v":"unknown"},{"$f":"TOID('SOURCE Integration'!C13)","v":""},{"$f":"TOID('SOURCE Integration'!D13)","v":""},{"$f":"IF('SOURCE Integration'!E13<>\"\",'SOURCE Integration'!E13,VLOOKUP(\"Payload default\", Constants, 2))","v":{"$error":"#N/A"}}]
[{"$f":"TOID(B14)","v":"int_013"},"INT-013",{"$f":"LEFT(B14, VLOOKUP(\"Small name size\", Constants, 2))","v":"INT-013"},{"$f":"IF('SOURCE Integration'!F14<>\"\",'SOURCE Integration'!F14,VLOOKUP(\"Version default\", Constants, 2))","v":"Data"},{"$f":"STRINGTOID(IF('SOURCE Integration'!E14<>\"\",'SOURCE Integration'!E14,IntegrationTag!A$2))","v":"unknown"},{"$f":"TOID('SOURCE Integration'!C14)","v":""},{"$f":"TOID('SOURCE Integration'!D14)","v":""},{"$f":"IF('SOURCE Integration'!E14<>\"\",'SOURCE Integration'!E14,VLOOKUP(\"Payload default\", Constants, 2))","v":{"$error":"#N/A"}}]
[{"$f":"TOID(B15)","v":"int_014"},"INT-014",{"$f":"LEFT(B15, VLOOKUP(\"Small name size\", Constants, 2))","v":"INT-014"},{"$f":"IF('SOURCE Integration'!F15<>\"\",'SOURCE Integration'!F15,VLOOKUP(\"Version default\", Constants, 2))","v":"Data"},{"$f":"STRINGTOID(IF('SOURCE Integration'!E15<>\"\",'SOURCE Integration'!E15,IntegrationTag!A$2))","v":"unknown"},{"$f":"TOID('SOURCE Integration'!C15)","v":""},{"$f":"TOID('SOURCE Integration'!D15)","v":""},{"$f":"IF('SOURCE Integration'!E15<>\"\",'SOURCE Integration'!E15,VLOOKUP(\"Payload default\", Constants, 2))","v":{"$error":"#N/A"}}]
{"$rows_left_out":12}
{"sheet":"IntegrationTag","index":6,"n_rows":8,"n_cols":6,"rows_kept":8,"cut":false,"hidden":false,"merged":[]}
["Id","Name","ShortName","Color","Status","Description"]
["unknown","Unknown",null,"#B00000","Standard"]
[null,null,null,"#CC9900","Standard"]
[null,null,null,"#385D35","Standard"]
[null,null,null,"#55CA42","Standard"]
[null,null,null,"#11868D","Standard"]
[null,null,null,"#1D99C7","Standard"]
[null,null,null,"#1D99C7","Standard"]

{"sheet":"FieldDefinition","index":7,"n_rows":1,"n_cols":14,"rows_kept":1,"cut":false,"hidden":false,"merged":[]}
["Scope","Id","Name","TaggedBy","Type","SubType","Required","VisibilityType","Description","IsArray","IsArrayLabeled","IsArrayOrdered","Options","Default"]

{"sheet":"SOURCE Application","index":8,"n_rows":3,"n_cols":5,"rows_kept":3,"cut":false,"hidden":false,"merged":[]}
["Name","Vendor","Business Owner","Version","Description"]
["SAP Finance","SAP","Accounts",null,"Core accounting platform"]
["Salesforce","Salesforce","Sales",null,"Core CRM paltform"]

{"sheet":"SOURCE Integration","index":9,"n_rows":3,"n_cols":7,"rows_kept":3,"cut":false,"hidden":false,"merged":[]}
["Id","Name","Source Application","Target Application","Payload","Version","Description"]
["int-001","SAP to Salesforce invoice message","SAP Finance","Salesforce","Invoice"]
["int-002","Salesforce to SAP invoice confirmation","Salesforce","SAP Finance","Invoice"]